Target
Sodium-dependent noradrenaline transporter
Ligand
BDBM50014224
Substrate
Meas. Tech.
ChEBML_131452
Ki
16±n/a nM
Citation
 Maryanoff, BEVaught, JLShank, RPMcComsey, DFCostanzo, MJNortey, SO Pyrroloisoquinoline antidepressants. 3. A focus on serotonin. J Med Chem 33:2793-7 (1990)  
Target
Name:
Sodium-dependent noradrenaline transporter
Synonyms:
Norepinephrine transporter Slc6a2 | Sodium-dependent noradrenaline transporter
Type:
Enzyme Catalytic Domain
Mol. Mass.:
69260.85
Organism:
MOUSE
Description:
Norepinephrine transporter 0 MOUSE::O55192
Residue:
617
  
Inhibitor
Name:
BDBM50014224
Synonyms:
8-Chloro-6-(4-methylsulfanyl-phenyl)-1,2,3,5,6,10b-hexahydro-pyrrolo[2,1-a]isoquinoline; hydrochloride | CHEMBL555655
Type:
Small organic molecule
Emp. Form.:
C19H20ClNS
Mol. Mass.:
329.887
SMILES:
CSc1ccc(cc1)C1CN2CCCC2c2ccc(Cl)cc12
: