Target
Mu-type opioid receptor
Ligand
BDBM50013625
Substrate
Meas. Tech.
ChEBML_145286
Ki
14±n/a nM
Citation
 Portoghese, PSSultana, MTakemori, AE Design of peptidomimetic delta opioid receptor antagonists using the message-address concept. J Med Chem 33:1714-20 (1990)  
Target
Name:
Mu-type opioid receptor
Synonyms:
M-OR-1 Mu opioid receptor OPIATE Mu OPRM_CAVPO
Type:
Enzyme Catalytic Domain
Mol. Mass.:
11165.58
Organism:
GUINEA PIG
Description:
P97266
Residue:
98
  
Inhibitor
Name:
BDBM50013625
Synonyms:
22-cyclopropylmethyl-11-methyl-(1S,2S,13R)-14-oxa-11,22-diazaheptacyclo[13.9.1.01,13.02,21.04,12.05,10.019,25]pentacosa-4(12),5(10),6,8,15,17,19(25)-heptaene-2,16-diol 22-cyclopropylmethyl-11-methyl-14-oxa-11,22-diazaheptacyclo[13.9.1.01,13.02,21.04,12.05,10.019,25]pentacosa-4(12),5(10),6,8,15,17,19(25)-heptaene-2,16-diol
Type:
Small organic molecule
Emp. Form.:
C27H28N2O3
Mol. Mass.:
428.5228
SMILES:
Cn1c2[C@@H]3Oc4c5c(CC6N(CC7CC7)CC[C@@]35[C@@]6(O)Cc2c2ccccc12)ccc4O
: