Target
Kappa-type opioid receptor
Ligand
BDBM50007366
Substrate
Meas. Tech.
ChEBML_145801
IC50
485±n/a nM
Citation
 Barlow, JJBlackburn, TPCostello, GFJames, RLe Count, DJMain, BGPearce, RJRussell, KShaw, JS Structure/activity studies related to 2-(3,4-dichlorophenyl)-N-methyl-N-[2-(1-pyrrolidinyl)-1-substituted- ethyl]acetamides: a novel series of potent and selective kappa-opioid agonists. J Med Chem 34:3149-58 (1991)  
Target
Name:
Kappa-type opioid receptor
Synonyms:
Kappa Opioid Receptor OPRK1 Opiate Kappa 1 | mu/kappa opioid receptor
Type:
G Protein-Coupled Receptor (GPCR)
Mol. Mass.:
42744.99
Organism:
Cavia porcellus (domestic guinea pig)
Description:
P41144
Residue:
380
  
Inhibitor
Name:
BDBM50007366
Synonyms:
CHEMBL110834 | N-(2-Methyl-1-pyrrolidin-1-ylmethyl-propyl)-2-phenyl-acetamide
Type:
Small organic molecule
Emp. Form.:
C17H26N2O
Mol. Mass.:
274.4011
SMILES:
CC(C)[C@@H](CN1CCCC1)NC(=O)Cc1ccccc1
: