Target
Kappa-type opioid receptor
Ligand
BDBM50007343
Substrate
Meas. Tech.
ChEBML_145801
IC50
1610±n/a nM
Citation
 Barlow, JJBlackburn, TPCostello, GFJames, RLe Count, DJMain, BGPearce, RJRussell, KShaw, JS Structure/activity studies related to 2-(3,4-dichlorophenyl)-N-methyl-N-[2-(1-pyrrolidinyl)-1-substituted- ethyl]acetamides: a novel series of potent and selective kappa-opioid agonists. J Med Chem 34:3149-58 (1991)  
Target
Name:
Kappa-type opioid receptor
Synonyms:
Kappa Opioid Receptor OPRK1 Opiate Kappa 1 | mu/kappa opioid receptor
Type:
G Protein-Coupled Receptor (GPCR)
Mol. Mass.:
42744.99
Organism:
Cavia porcellus (domestic guinea pig)
Description:
P41144
Residue:
380
  
Inhibitor
Name:
BDBM50007343
Synonyms:
CHEMBL327120 | N-{1-[(Benzyl-methyl-amino)-methyl]-2-methyl-propyl}-2-(3,4-dichloro-phenyl)-N-methyl-acetamide
Type:
Small organic molecule
Emp. Form.:
C22H28Cl2N2O
Mol. Mass.:
407.377
SMILES:
CC(C)[C@@H](CN(C)Cc1ccccc1)N(C)C(=O)Cc1ccc(Cl)c(Cl)c1
: