Target
Kappa-type opioid receptor
Ligand
BDBM50007339
Substrate
Meas. Tech.
ChEBML_145801
IC50
1440±n/a nM
Citation
 Barlow, JJBlackburn, TPCostello, GFJames, RLe Count, DJMain, BGPearce, RJRussell, KShaw, JS Structure/activity studies related to 2-(3,4-dichlorophenyl)-N-methyl-N-[2-(1-pyrrolidinyl)-1-substituted- ethyl]acetamides: a novel series of potent and selective kappa-opioid agonists. J Med Chem 34:3149-58 (1991)  
Target
Name:
Kappa-type opioid receptor
Synonyms:
Kappa Opioid Receptor OPRK1 Opiate Kappa 1 | mu/kappa opioid receptor
Type:
G Protein-Coupled Receptor (GPCR)
Mol. Mass.:
42744.99
Organism:
Cavia porcellus (domestic guinea pig)
Description:
P41144
Residue:
380
  
Inhibitor
Name:
BDBM50007339
Synonyms:
CHEMBL109115 | N-(2-Methyl-1-pyrrolidin-1-ylmethyl-propyl)-2-phenyl-N-propyl-acetamide
Type:
Small organic molecule
Emp. Form.:
C20H32N2O
Mol. Mass.:
316.4809
SMILES:
CCCN([C@H](CN1CCCC1)C(C)C)C(=O)Cc1ccccc1
: