Target
Mu-type opioid receptor
Ligand
BDBM50453049
Substrate
Meas. Tech.
ChEMBL_147104 (CHEMBL882760)
IC50
>10000±n/a nM
Citation
 Hruby, VJToth, GGehrig, CAKao, LFKnapp, RLui, GKYamamura, HIKramer, THDavis, PBurks, TF Topographically designed analogues of [D-Pen,D-Pen5]enkephalin. J Med Chem 34:1823-30 (1991)  
Target
Name:
Mu-type opioid receptor
Synonyms:
M-OR-1 Mu opioid receptor OPIATE Mu OPRM_CAVPO
Type:
Enzyme Catalytic Domain
Mol. Mass.:
11165.58
Organism:
GUINEA PIG
Description:
P97266
Residue:
98
  
Inhibitor
Name:
BDBM50453049
Synonyms:
CHEMBL2115043
Type:
Small organic molecule
Emp. Form.:
C31H40N6O9S2
Mol. Mass.:
704.814
SMILES:
[H][C@]1(NC(=O)CNC(=O)[C@@H](NC(=O)[C@@H](N)Cc2ccc(O)cc2)C(C)(C)SSC(C)(C)[C@H](NC1=O)C(O)=O)[C@H](C)c1ccc(cc1)[N+]([O-])=O
: