Target
Sodium-dependent dopamine transporter
Ligand
BDBM50453091
Substrate
Meas. Tech.
ChEBML_61992
IC50
1.8±n/a nM
Citation
 Carroll, FIGao, YGRahman, MAAbraham, PParham, KLewin, AHBoja, JWKuhar, MJ Synthesis, ligand binding, QSAR, and CoMFA study of 3 beta-(p-substituted phenyl)tropane-2 beta-carboxylic acid methyl esters. J Med Chem 34:2719-25 (1991)  
Target
Name:
Sodium-dependent dopamine transporter
Synonyms:
DA transporter SC6A3_RAT Sodium-dependent dopamine transporter | Sodium-dependent dopamine transporter (DAT)
Type:
Multi-pass membrane protein
Mol. Mass.:
68749.45
Organism:
Rattus norvegicus (rat)
Description:
P23977
Residue:
619
  
Inhibitor
Name:
BDBM50453091
Synonyms:
CHEMBL2310929
Type:
Small organic molecule
Emp. Form.:
C16H20BrNO2
Mol. Mass.:
338.24
SMILES:
[H][C@@]12CCC(C([C@@H](C1)c1ccc(Br)cc1)C(=O)OC)N2C
: