Target
Androgen receptor
Ligand
BDBM50006108
Substrate
Meas. Tech.
ChEBML_36427
Ki
>29000±n/a nM
Citation
 Mallamo, JPPilling, GMWetzel, JRKowalczyk, PJBell, MRKullnig, RKBatzold, FHJuniewicz, PEWinneker, RCLuss, HR Antiandrogenic steroidal sulfonyl heterocycles. Utility of electrostatic complementarity in defining bioisosteric sulfonyl heterocycles. J Med Chem 35:1663-70 (1992)  
Target
Name:
Androgen receptor
Synonyms:
ANDR_RAT Ar Nr3c4 | androgen
Type:
Enzyme
Mol. Mass.:
98219.08
Organism:
Rattus norvegicus (Rat)
Description:
P15207
Residue:
902
  
Inhibitor
Name:
BDBM50006108
Synonyms:
1-Ethynyl-8-methanesulfonyl-10a,12a-dimethyl-2,3,3a,3b,4,5,5a,6,10,10a,10b,11,12,12a-tetradecahydro-1H-9-oxa-dicyclopenta[a,h]phenanthren-1-ol | CHEMBL44834
Type:
Small organic molecule
Emp. Form.:
C24H32O4S
Mol. Mass.:
416.573
SMILES:
C[C@]12CCC3C(CC[C@H]4Cc5cc(oc5C[C@]34C)S(C)(=O)=O)C1CC[C@@]2(O)C#C
: