Target
Gastrin/cholecystokinin type B receptor
Ligand
BDBM50002474
Substrate
Meas. Tech.
ChEBML_47971
IC50
2100±n/a nM
Citation
 Shiosaki, KLin, CWKopecka, HCraig, RABianchi, BRMiller, TRWitte, DGStashko, MNadzan, AM Development of potent and selective CCK-A receptor agonists from Boc-CCK-4: tetrapeptides containing Lys(N epsilon)-amide residues. J Med Chem 35:2007-14 (1992)  
Target
Name:
Gastrin/cholecystokinin type B receptor
Synonyms:
CCK-2 receptor CCK-BR CCKRB Cholecystokinin receptor GASR_HUMAN | Gastrin/cholecystokinin type B receptor
Type:
G Protein-Coupled Receptor (GPCR)
Mol. Mass.:
48445.79
Organism:
Homo sapiens (Human)
Description:
Stable expression of human CCK-2 receptors in HEK 293 cells.
Residue:
447
  
Inhibitor
Name:
BDBM50002474
Synonyms:
3-{2-[2-tert-Butoxycarbonylamino-3-(1H-indol-3-yl)-propionylamino]-6-[3-(4-dimethylamino-phenyl)-acryloylamino]-hexanoylamino}-N-(1-carbamoyl-2-phenyl-ethyl)-succinamic acid; hydrate | CHEMBL3144561
Type:
Small organic molecule
Emp. Form.:
C46H58N8O9
Mol. Mass.:
867.0009
SMILES:
CN(C)c1ccc(\C=C/C(=O)NCCCC[C@H](NC(=O)[C@H](Cc2c[nH]c3ccccc23)NC(=O)OC(C)(C)C)C(=O)N[C@@H](CC(O)=O)C(=O)N[C@@H](Cc2ccccc2)C(N)=O)cc1
: