Target
Mu-type opioid receptor
Ligand
BDBM50001105
Substrate
Meas. Tech.
ChEBML_146261
Ki
57±n/a nM
Citation
 Vecchietti, VClarke, GDColle, RDondio, GGiardina, GPetrone, GSbacchi, M Substituted 1-(aminomethyl)-2-(arylacetyl)-1,2,3,4-tetrahydroisoquinolines: a novel class of very potent antinociceptive agents with varying degrees of selectivity for kappa and mu opioid receptors. J Med Chem 35:2970-8 (1992)  
Target
Name:
Mu-type opioid receptor
Synonyms:
M-OR-1 Mu opioid receptor OPIATE Mu OPRM_CAVPO
Type:
Enzyme Catalytic Domain
Mol. Mass.:
11165.58
Organism:
GUINEA PIG
Description:
P97266
Residue:
98
  
Inhibitor
Name:
BDBM50001105
Synonyms:
2-(3,4-Dichloro-phenyl)-1-(4-methyl-1-pyrrolidin-1-ylmethyl-3,4-dihydro-1H-isoquinolin-2-yl)-ethanone | CHEMBL101396
Type:
Small organic molecule
Emp. Form.:
C23H26Cl2N2O
Mol. Mass.:
417.371
SMILES:
C[C@@H]1CN(C(CN2CCCC2)c2ccccc12)C(=O)Cc1ccc(Cl)c(Cl)c1
: