Target
Reverse transcriptase/RNaseH
Ligand
BDBM50132287
Substrate
Meas. Tech.
ChEMBL_195198 (CHEMBL798388)
IC50
<50±n/a nM
Citation
 Bergstrom, DEMott, AWDe Clercq, EBalzarini, JSwartling, DJ 3',3'-Difluoro-3'-deoxythymidine: comparison of anti-HIV activity to 3'-fluoro-3'-deoxythymidine. J Med Chem 35:3369-72 (1992)  
Target
Name:
Reverse transcriptase/RNaseH
Synonyms:
HIV-1 Reverse Transcriptase RNase H Reverse transcriptase/RNaseH
Type:
PROTEIN
Mol. Mass.:
65229.15
Organism:
Human immunodeficiency virus 1
Description:
ChEMBL_1473730
Residue:
566
  
Inhibitor
Name:
BDBM50132287
Synonyms:
1-((2R,4S,5R)-4-fluoro-5-(hydroxymethyl)tetrahydrofuran-2-yl)-5-methylpyrimidine-2,4(1H,3H)-dione 3'-Fluoro-2',3'-dideoxythymidine CHEMBL105318
Type:
Small organic molecule
Emp. Form.:
C10H13FN2O4
Mol. Mass.:
244.2196
SMILES:
Cc1cn([C@H]2C[C@H](F)[C@@H](CO)O2)c(=O)[nH]c1=O
: