Target
Renin
Ligand
BDBM50003180
Substrate
Meas. Tech.
ChEBML_195749
pH
7.4±n/a
IC50
580±n/a nM
Comments
extracted
Citation
 Weber, AESteiner, MGKrieter, PAColletti, AETata, JRHalgren, TABall, RGDoyle, JJSchorn, TWStearns, RA Highly potent, orally active diester macrocyclic human renin inhibitors. J Med Chem 35:3755-73 (1992)  
Target
Name:
Renin
Synonyms:
Angiotensinogenase RENI_HUMAN
Type:
Enzyme
Mol. Mass.:
45058.99
Organism:
Homo sapiens (Human)
Description:
Residue:
406
  
Inhibitor
Name:
BDBM50003180
Synonyms:
(diastereomer-1) {1-[6-Cyclohexylmethyl-10-(2,2-dimethyl-propyl)-7-hydroxy-4,8,13-trioxo-1,9-dioxa-5-aza-cyclotridec-3-ylcarbamoyl]-2-phenyl-ethyl}-carbamic acid tert-butyl ester CHEMBL264636
Type:
Small organic molecule
Emp. Form.:
C36H55N3O9
Mol. Mass.:
673.8366
SMILES:
CC(C)(C)CC1CCC(=O)OC[C@H](NC(=O)C(Cc2ccccc2)NC(=O)OC(C)(C)C)C(=O)N[C@@H](CC2CCCCC2)[C@@H](O)C(=O)O1
: