Target
Adenosine deaminase
Ligand
BDBM50003601
Substrate
Meas. Tech.
ChEMBL_30784 (CHEMBL645061)
Ki
1600±n/a nM
Citation
 Harriman, GCPoirot, AFAbushanab, EMidgett, RMStoeckler, JD Adenosine deaminase inhibitors. Synthesis and biological evaluation of C1' and nor-C1' derivatives of (+)-erythro-9-(2(S)-hydroxy-3(R)-nonyl)adenine. J Med Chem 35:4180-4 (1992)  
Target
Name:
Adenosine deaminase
Synonyms:
ADA Adenosine aminohydrolase
Type:
Enzyme
Mol. Mass.:
40910.44
Organism:
Bos taurus (bovine)
Description:
Residue:
363
  
Inhibitor
Name:
BDBM50003601
Synonyms:
9-(1-Fluoromethyl-heptyl)-9H-purin-6-ylamine | CHEMBL336534
Type:
Small organic molecule
Emp. Form.:
C13H20FN5
Mol. Mass.:
265.3298
SMILES:
CCCCCC[C@H](CF)n1cnc2c(N)ncnc12
: