Target
Sterol O-acyltransferase 1
Ligand
BDBM50368458
Substrate
Meas. Tech.
ChEBML_28352
IC50
170±n/a nM
Citation
 Harris, NVSmith, CAshton, MJBridge, AWBush, RCCoffee, ECDron, DIHarper, MFLythgoe, DJNewton, CG Acyl-CoA:cholesterol O-acyl transferase (ACAT) inhibitors. 1. 2-(Alkylthio)-4,5-diphenyl-1H-imidazoles as potent inhibitors of ACAT. J Med Chem 35:4384-92 (1992)  
Target
Name:
Sterol O-acyltransferase 1
Synonyms:
ACAT-1 Acat SOAT1_RAT Sterol O-acyltransferase, Soat
Type:
PROTEIN
Mol. Mass.:
64165.56
Organism:
Rattus norvegicus
Description:
ChEMBL_28796
Residue:
545
  
Inhibitor
Name:
BDBM50368458
Synonyms:
CHEMBL1794872
Type:
Small organic molecule
Emp. Form.:
C24H26N2O3S
Mol. Mass.:
422.54
SMILES:
Cc1ccc(cc1)-c1nc(SC[C@H]2C[C@@](C)(O)CC(=O)O2)[nH]c1-c1ccc(C)cc1
: