Target
Acetylcholinesterase
Ligand
BDBM50005758
Substrate
Meas. Tech.
ChEBML_28304
IC50
20±n/a nM
Citation
 Chen, YLNielsen, JHedberg, KDunaiskis, AJones, SRusso, LJohnson, JIves, JListon, D Syntheses, resolution, and structure-activity relationships of potent acetylcholinesterase inhibitors: 8-carbaphysostigmine analogues. J Med Chem 35:1429-34 (1992)  
Target
Name:
Acetylcholinesterase
Synonyms:
ACES_HUMAN Acetylcholinesterase (AChE) | Acetylcholinesterase (human AChE)
Type:
Enzyme
Mol. Mass.:
67792.70
Organism:
Homo sapiens (Human)
Description:
P22303
Residue:
614
  
Inhibitor
Name:
BDBM50005758
Synonyms:
(+)-Hexyl-carbamic acid 1-ethyl-3a-methyl-1,2,3,3a,8,8a-hexahydro-1-aza-cyclopenta[a]inden-5-yl ester (-)-Hexyl-carbamic acid 1-ethyl-3a-methyl-1,2,3,3a,8,8a-hexahydro-1-aza-cyclopenta[a]inden-5-yl ester | CHEMBL34222
Type:
Small organic molecule
Emp. Form.:
C21H32N2O2
Mol. Mass.:
344.491
SMILES:
CCCCCCNC(=O)Oc1ccc2CC3N(CC)CC[C@@]3(C)c2c1
: