Target
Acetylcholinesterase
Ligand
BDBM50005767
Substrate
Meas. Tech.
ChEBML_28304
IC50
1330±n/a nM
Citation
 Chen, YLNielsen, JHedberg, KDunaiskis, AJones, SRusso, LJohnson, JIves, JListon, D Syntheses, resolution, and structure-activity relationships of potent acetylcholinesterase inhibitors: 8-carbaphysostigmine analogues. J Med Chem 35:1429-34 (1992)  
Target
Name:
Acetylcholinesterase
Synonyms:
ACES_HUMAN Acetylcholinesterase (AChE) | Acetylcholinesterase (human AChE)
Type:
Enzyme
Mol. Mass.:
67792.70
Organism:
Homo sapiens (Human)
Description:
P22303
Residue:
614
  
Inhibitor
Name:
BDBM50005767
Synonyms:
(+/-)-(1-Phenyl-ethyl)-carbamic acid 1-ethyl-3a-methyl-1,2,3,3a,8,8a-hexahydro-1-aza-cyclopenta[a]inden-5-yl ester | CHEMBL33173
Type:
Small organic molecule
Emp. Form.:
C23H28N2O2
Mol. Mass.:
364.4806
SMILES:
CCN1CC[C@]2(C)C1Cc1ccc(OC(=O)N[C@@H](C)c3ccccc3)cc21
: