Target
Dihydrofolate reductase
Ligand
BDBM50005865
Substrate
Meas. Tech.
ChEBML_54097
IC50
12000±n/a nM
Citation
 Rosowsky, AForsch, RAReich, VEFreisheim, JHMoran, RG Side chain modified 5-deazafolate and 5-deazatetrahydrofolate analogues as mammalian folylpolyglutamate synthetase and glycinamide ribonucleotide formyltransferase inhibitors: synthesis and in vitro biological evaluation. J Med Chem 35:1578-88 (1992)  
Target
Name:
Dihydrofolate reductase
Synonyms:
DHFR Dihydrofolate reductase (DHFR) | Tetrahydrofolate dehydrogenase
Type:
Enzyme
Mol. Mass.:
21453.99
Organism:
Homo sapiens (Human)
Description:
Recombinant human DHFR.
Residue:
187
  
Inhibitor
Name:
BDBM50005865
Synonyms:
2-{4-[(2-Amino-4-oxo-3,4,5,6,7,8-hexahydro-pyrido[2,3-d]pyrimidin-6-ylmethyl)-amino]-benzoylamino}-4-sulfo-butyric acid | CHEMBL417696
Type:
Small organic molecule
Emp. Form.:
C19H24N6O7S
Mol. Mass.:
480.495
SMILES:
Nc1nc2NCC(CNc3ccc(cc3)C(=O)NC(CCS(O)(=O)=O)C(O)=O)Cc2c(=O)[nH]1
: