Target
Purine nucleoside phosphorylase
Ligand
BDBM50005921
Substrate
Meas. Tech.
ChEBML_162185
IC50
31400±n/a nM
Citation
 Sircar, JCKostlan, CRGilbertsen, RBBennett, MKDong, MKCetenko, WJ Inhibitors of human purine nucleoside phosphorylase. Synthesis of pyrrolo[3,2-d]pyrimidines, a new class of purine nucleoside phosphorylase inhibitors as potentially T-cell selective immunosuppressive agents. Description of 2,6-diamino-3,5-dihydro-7-(3-thienylmethyl)-4H-pyrrolo[3,2-d] pyrimidin-4-o J Med Chem 35:1605-9 (1992)  
Target
Name:
Purine nucleoside phosphorylase
Synonyms:
Inosine phosphorylase NP PNPH_HUMAN | Purine nucleoside phosphorylase (PNPase)
Type:
Enzyme
Mol. Mass.:
32119.53
Organism:
Homo sapiens (Human)
Description:
Residue:
289
  
Inhibitor
Name:
BDBM50005921
Synonyms:
2,6-Diamino-7-(2-methoxy-benzyl)-3,5-dihydro-pyrrolo[3,2-d]pyrimidin-4-one | CHEMBL288737
Type:
Small organic molecule
Emp. Form.:
C14H15N5O2
Mol. Mass.:
285.3012
SMILES:
COc1ccccc1Cc1c(N)[nH]c2c1nc(N)[nH]c2=O
: