Target
Purine nucleoside phosphorylase
Ligand
BDBM50368611
Substrate
Meas. Tech.
ChEMBL_162185 (CHEMBL766705)
Ki
200±n/a nM
Citation
 Sircar, JCKostlan, CRGilbertsen, RBBennett, MKDong, MKCetenko, WJ Inhibitors of human purine nucleoside phosphorylase. Synthesis of pyrrolo[3,2-d]pyrimidines, a new class of purine nucleoside phosphorylase inhibitors as potentially T-cell selective immunosuppressive agents. Description of 2,6-diamino-3,5-dihydro-7-(3-thienylmethyl)-4H-pyrrolo[3,2-d] pyrimidin-4-o J Med Chem 35:1605-9 (1992)  
Target
Name:
Purine nucleoside phosphorylase
Synonyms:
Inosine phosphorylase NP PNPH_HUMAN | Purine nucleoside phosphorylase (PNPase)
Type:
Enzyme
Mol. Mass.:
32119.53
Organism:
Homo sapiens (Human)
Description:
Residue:
289
  
Inhibitor
Name:
BDBM50368611
Synonyms:
CHEMBL604864
Type:
Small organic molecule
Emp. Form.:
C11H12ClN3O4
Mol. Mass.:
285.684
SMILES:
O[C@@H]1[C@@H](CCl)OC([C@@H]1O)c1c[nH]c2c1nc[nH]c2=O
: