Target
Substance-P receptor
Ligand
BDBM50045036
Substrate
Meas. Tech.
ChEMBL_141656 (CHEMBL749779)
IC50
21±n/a nM
Citation
 Kucharczyk, NThurieau, CPaladino, JMorris, ADBonnet, JCanet, EKrause, JERegoli, DCouture, RFauchère, JL Tetrapeptide tachykinin antagonists: synthesis and modulation of the physicochemical and pharmacological properties of a new series of partially cyclic analogs. J Med Chem 36:1654-61 (1993)  
Target
Name:
Substance-P receptor
Synonyms:
NK-1 receptor NK1 Receptor NK1R_HUMAN Neurokinin-1 (NK-1) SPR TACR1 Tachykinin receptor 1 (NK1) | tachykinin
Type:
G Protein-Coupled Receptor (GPCR)
Mol. Mass.:
46254.43
Organism:
Homo sapiens (Human)
Description:
P25103
Residue:
407
  
Inhibitor
Name:
BDBM50045036
Synonyms:
7-(3-{2-[1-(Benzyl-methyl-carbamoyl)-2-phenyl-ethylcarbamoyl]-2-[2-(3,6-dioxo-2,5-diaza-tricyclo[6.2.2.0*2,7*]dodec-4-yl)-acetylamino]-ethyl}-indol-1-yl)-7-oxo-heptyl-ammonium | CHEMBL3144209
Type:
Small organic molecule
Emp. Form.:
C47H57N7O6
Mol. Mass.:
815.9988
SMILES:
CN(Cc1ccccc1)C(=O)[C@H](Cc1ccccc1)NC(=O)[C@@H](Cc1cn(C(=O)CCCCCCN)c2ccccc12)NC(=O)C[C@@H]1NC(=O)[C@@H]2C3CCC(CC3)N2C1=O
: