Target
Gag-Pol polyprotein [489-587]
Ligand
BDBM50041035
Substrate
Meas. Tech.
ChEMBL_159149 (CHEMBL878776)
EC50
60±n/a nM
Citation
 Greer, JErickson, JWBaldwin, JJVarney, MD Application of the three-dimensional structures of protein target molecules in structure-based drug design. J Med Chem 37:1035-54 (1994)  
Target
Name:
Gag-Pol polyprotein [489-587]
Synonyms:
Human immunodeficiency virus type 1 protease Pol polyprotein | gag-pol
Type:
Enzyme Subunit
Mol. Mass.:
10781.16
Organism:
Human immunodeficiency virus type 1
Description:
P04585[489-587]
Residue:
99
  
Inhibitor
Name:
BDBM50041035
Synonyms:
CHEMBL269401 | N-{(1S,2R,3R,4S)-1-Benzyl-2,3-dihydroxy-4-[3-methyl-2-(3-methyl-3-pyridin-2-ylmethyl-ureido)-butyrylamino]-5-phenyl-pentyl}-3-methyl-2-(3-methyl-3-pyridin-2-ylmethyl-ureido)-butyramide
Type:
Small organic molecule
Emp. Form.:
C44H58N8O6
Mol. Mass.:
794.9813
SMILES:
CC(C)C(NC(=O)N(C)Cc1ccccn1)C(=O)N[C@@H](Cc1ccccc1)[C@@H](O)[C@H](O)[C@H](Cc1ccccc1)NC(=O)C(NC(=O)N(C)Cc1ccccn1)C(C)C
: