Target
D(2) dopamine receptor
Ligand
BDBM21398
Substrate
Meas. Tech.
ChEMBL_59154 (CHEMBL671035)
Ki
5±n/a nM
Citation
 Thurkauf, AYuan, JChen, XWasley, JWMeade, RWoodruff, KHHuston, KRoss, PC 1-Phenyl-3-(aminomethyl)pyrroles as potential antipsychotic agents. Synthesis and dopamine receptor binding. J Med Chem 38:4950-2 (1996)  
Target
Name:
D(2) dopamine receptor
Synonyms:
DRD2 Dopamine D2 receptor
Type:
PROTEIN
Mol. Mass.:
50619.11
Organism:
Cercopithecus aethiops
Description:
ChEMBL_59156
Residue:
443
  
Inhibitor
Name:
BDBM21398
Synonyms:
4-[4-(4-Chloro-phenyl)-4-hydroxy-piperidin-1-yl]-1-(4-fluoro-phenyl)-butan-1-one;propionate(HCl) CHEMBL54 Haloperidol | Haloperidol, 1
Type:
Small organic molecule
Emp. Form.:
C21H23ClFNO2
Mol. Mass.:
375.864
SMILES:
OC1(CCN(CCCC(=O)c2ccc(F)cc2)CC1)c1ccc(Cl)cc1
: