Target
Thyroid hormone receptor beta
Ligand
BDBM50036417
Substrate
Meas. Tech.
ChEMBL_143914 (CHEMBL872845)
IC50
0.68±n/a nM
Citation
 Yokoyama, NWalker, GNMain, AJStanton, JLMorrissey, MMBoehm, CEngle, ANeubert, ADWasvary, JMStephan, ZF Synthesis and structure-activity relationships of oxamic acid and acetic acid derivatives related to L-thyronine. J Med Chem 38:695-707 (1995)  
Target
Name:
Thyroid hormone receptor beta
Synonyms:
Erba2 THB_RAT Thyroid Hormone Receptor (TR-beta) Thyroid hormone receptor beta-1 | thyroid beta
Type:
Enzyme Catalytic Domain
Mol. Mass.:
52661.52
Organism:
RAT
Description:
thyroid beta 0 RAT::P18113
Residue:
461
  
Inhibitor
Name:
BDBM50036417
Synonyms:
CHEMBL423977 | N-{3,5-Dichloro-4-[3-(4-fluoro-benzyl)-4-hydroxy-phenoxy]-phenyl}-oxalamic acid
Type:
Small organic molecule
Emp. Form.:
C21H14Cl2FNO5
Mol. Mass.:
450.244
SMILES:
OC(=O)C(=O)Nc1cc(Cl)c(Oc2ccc(O)c(Cc3ccc(F)cc3)c2)c(Cl)c1
: