Target
Thyroid hormone receptor beta
Ligand
BDBM18862
Substrate
Meas. Tech.
ChEMBL_143914 (CHEMBL872845)
IC50
0.15±n/a nM
Citation
 Yokoyama, NWalker, GNMain, AJStanton, JLMorrissey, MMBoehm, CEngle, ANeubert, ADWasvary, JMStephan, ZF Synthesis and structure-activity relationships of oxamic acid and acetic acid derivatives related to L-thyronine. J Med Chem 38:695-707 (1995)  
Target
Name:
Thyroid hormone receptor beta
Synonyms:
Erba2 THB_RAT Thyroid Hormone Receptor (TR-beta) Thyroid hormone receptor beta-1 | thyroid beta
Type:
Enzyme Catalytic Domain
Mol. Mass.:
52661.52
Organism:
RAT
Description:
thyroid beta 0 RAT::P18113
Residue:
461
  
Inhibitor
Name:
BDBM18862
Synonyms:
2-[4-(4-hydroxy-3-iodophenoxy)-3,5-diiodophenyl]acetic acid TRIAC Triiodothyroacetic acid, 3 | US10322118, Entry Tiratricol
Type:
Small organic molecule
Emp. Form.:
C14H9I3O4
Mol. Mass.:
621.9323
SMILES:
OC(=O)Cc1cc(I)c(Oc2ccc(O)c(I)c2)c(I)c1
: