Target
Neuromedin-K receptor
Ligand
BDBM50051293
Substrate
Meas. Tech.
ChEMBL_209561 (CHEMBL808517)
Ki
1±n/a nM
Citation
 Giardina, GASarau, HMFarina, CMedhurst, ADGrugni, MFoley, JJRaveglia, LFSchmidt, DBRigolio, RVassallo, MVecchietti, VHay, DW 2-Phenyl-4-quinolinecarboxamides: a novel class of potent and selective non-peptide competitive antagonists for the human neurokinin-3 receptor. J Med Chem 39:2281-4 (1996)  
Target
Name:
Neuromedin-K receptor
Synonyms:
NK-3 receptor NK3R NKR Neurokinin B receptor Neuromedin-3 receptor (NK-3R) Neuromedin-K receptor Neuromedin-K receptor (NK3) TAC3R Tachykinin receptor 3 | Tachykinin receptor 3 (NK3)
Type:
Enzyme
Mol. Mass.:
52221.96
Organism:
Homo sapiens (Human)
Description:
P29371
Residue:
465
  
Inhibitor
Name:
BDBM50051293
Synonyms:
(S)-(-)-N-(R-ethylbenzyl)-3-hydroxy-2-phenylquinoline-4-carboxamide 3-Hydroxy-2-phenyl-quinoline-4-carboxylic acid (1-phenyl-propyl)-amide SB 223412 SB-223412 | Talnetant
Type:
Small organic molecule
Emp. Form.:
C25H22N2O2
Mol. Mass.:
382.4544
SMILES:
CC[C@H](NC(=O)c1c(O)c(nc2ccccc12)-c1ccccc1)c1ccccc1
: