Target
Polyunsaturated fatty acid 5-lipoxygenase
Ligand
BDBM50053543
Substrate
Meas. Tech.
ChEMBL_3826 (CHEMBL618012)
IC50
70±n/a nM
Citation
 Delorme, DDucharme, YBrideau, CChan, CCChauret, NDesmarais, SDubé, DFalgueyret, JPFortin, RGuay, JHamel, PJones, TRLépine, CLi, CMcAuliffe, MMcFarlane, CSNicoll-Griffith, DARiendeau, DYergey, JAGirard, Y Dioxabicyclooctanyl naphthalenenitriles as nonredox 5-lipoxygenase inhibitors: structure-activity relationship study directed toward the improvement of metabolic stability. J Med Chem 39:3951-70 (1996)  
Target
Name:
Polyunsaturated fatty acid 5-lipoxygenase
Synonyms:
5-LO 5-Lipoxygenase (5-LO) 5-Lipoygenase ALOX5 LOG5 | LOX5_HUMAN
Type:
Enzyme
Mol. Mass.:
77972.74
Organism:
Homo sapiens (Human)
Description:
Recombinant protein was purified from E. coli lysate. After ammonium sulfate precipitation and subsequent steps, the supernatant (S100) was used for 5-LO activity assay.
Residue:
674
  
Inhibitor
Name:
BDBM50053543
Synonyms:
7-[3-(4-Hydroxy-tetrahydro-pyran-4-yl)-benzyloxy]-4-phenyl-naphthalene-2-carboxylic acid methyl ester | CHEMBL414244
Type:
Small organic molecule
Emp. Form.:
C30H28O5
Mol. Mass.:
468.5403
SMILES:
COC(=O)c1cc(-c2ccccc2)c2ccc(OCc3cccc(c3)C3(O)CCOCC3)cc2c1
: