Target
D(2) dopamine receptor
Ligand
BDBM50054087
Substrate
Meas. Tech.
ChEMBL_62239 (CHEMBL671571)
Ki
2.7±n/a nM
Citation
 Claudi, FCingolani, GMDi Stefano, AGiorgioni, GAmenta, FBarili, PFerrari, FGiuliani, D Synthesis, resolution, and preliminary evaluation of trans-2-amino-6(5)-hydroxy-1-phenyl-2,3-dihydro-1H-indenes and related derivatives as dopamine receptors ligands. J Med Chem 39:4238-46 (1996)  
Target
Name:
D(2) dopamine receptor
Synonyms:
DOPAMINE D2 DOPAMINE D2 Short Dopamine D2 receptor Drd2
Type:
G Protein-Coupled Receptor (GPCR)
Mol. Mass.:
50931.60
Organism:
Rattus norvegicus (rat)
Description:
P61169
Residue:
444
  
Inhibitor
Name:
BDBM50054087
Synonyms:
6-[(3-Amino-propyl)-phenethyl-amino]-5,6,7,8-tetrahydro-naphthalen-1-ol | CHEMBL134344
Type:
Small organic molecule
Emp. Form.:
C21H28N2O
Mol. Mass.:
324.4598
SMILES:
NCCCN(CCc1ccccc1)C1CCc2c(O)cccc2C1
: