Target
D(2) dopamine receptor
Ligand
BDBM50051261
Substrate
Meas. Tech.
ChEMBL_61578 (CHEMBL675092)
IC50
100±n/a nM
Citation
 Norman, MHRigdon, GCHall, WRNavas, F Structure-activity relationships of a series of substituted benzamides: potent D2/5-HT2 antagonists and 5-HT1a agonists as neuroleptic agents. J Med Chem 39:1172-88 (1996)  
Target
Name:
D(2) dopamine receptor
Synonyms:
DOPAMINE D2 DOPAMINE D2 Short Dopamine D2 receptor Drd2
Type:
G Protein-Coupled Receptor (GPCR)
Mol. Mass.:
50931.60
Organism:
Rattus norvegicus (rat)
Description:
P61169
Residue:
444
  
Inhibitor
Name:
BDBM50051261
Synonyms:
CHEMBL537025 | N-[4-(4-Benzo[d]isothiazol-3-yl-piperazin-1-yl)-butyl]-3,5-dichloro-benzamide; hydrochloride
Type:
Small organic molecule
Emp. Form.:
C22H24Cl2N4OS
Mol. Mass.:
463.423
SMILES:
Clc1cc(Cl)cc(c1)C(=O)NCCCCN1CCN(CC1)c1nsc2ccccc12
: