Target
5-hydroxytryptamine receptor 1A
Ligand
BDBM50051246
Substrate
Meas. Tech.
ChEMBL_862 (CHEMBL615918)
IC50
4.1±n/a nM
Citation
 Norman, MHRigdon, GCHall, WRNavas, F Structure-activity relationships of a series of substituted benzamides: potent D2/5-HT2 antagonists and 5-HT1a agonists as neuroleptic agents. J Med Chem 39:1172-88 (1996)  
Target
Name:
5-hydroxytryptamine receptor 1A
Synonyms:
5-HT-1A 5-HT1A 5-hydroxytryptamine receptor 1A (5HT1A) 5ht1a Htr1a Serotonin 1a (5-HT1a) receptor/Adrenergic receptor alpha-1 | Serotonin receptor 1A
Type:
G Protein-Coupled Receptor (GPCR)
Mol. Mass.:
46445.29
Organism:
Rattus norvegicus (rat)
Description:
Binding assays were performed using rat hippocampal membranes.
Residue:
422
  
Inhibitor
Name:
BDBM50051246
Synonyms:
2-Amino-N-[4-(4-benzo[d]isothiazol-3-yl-piperazin-1-yl)-butyl]-3-methoxy-benzamide; hydrochloride | CHEMBL545371
Type:
Small organic molecule
Emp. Form.:
C23H29N5O2S
Mol. Mass.:
439.574
SMILES:
COc1cccc(C(=O)NCCCCN2CCN(CC2)c2nsc3ccccc23)c1N
: