Target
Prothrombin
Ligand
BDBM50060710
Substrate
Meas. Tech.
ChEMBL_208549 (CHEMBL814318)
Ki
16±n/a nM
Citation
 Tucker, TJLumma, WCLewis, SDGardell, SJLucas, BJSisko, JTLynch, JJLyle, EABaskin, EPWoltmann, RFAppleby, SDChen, IWDancheck, KBNaylor-Olsen, AMKrueger, JACooper, CMVacca, JP Synthesis of a series of potent and orally bioavailable thrombin inhibitors that utilize 3,3-disubstituted propionic acid derivatives in the P3 position. J Med Chem 40:3687-93 (1997)  
Target
Name:
Prothrombin
Synonyms:
Activation peptide fragment 1 Coagulation factor II Prothrombin precursor Thrombin heavy chain | Thrombin light chain
Type:
Protein
Mol. Mass.:
70029.57
Organism:
Homo sapiens (Human)
Description:
P00734
Residue:
622
  
Inhibitor
Name:
BDBM50060710
Synonyms:
(S)-1-(3,3-Diphenyl-butyryl)-pyrrolidine-2-carboxylic acid (4-amino-cyclohexylmethyl)-amide; hydrochloride | CHEMBL543648
Type:
Small organic molecule
Emp. Form.:
C28H37N3O2
Mol. Mass.:
447.6123
SMILES:
CC(CC(=O)N1CCC[C@H]1C(=O)NCC1CCC(N)CC1)(c1ccccc1)c1ccccc1
: