Target
Glutamate receptor ionotropic, NMDA 1/2C
Ligand
BDBM50066541
Substrate
Meas. Tech.
ChEMBL_59 (CHEMBL615182)
IC50
>100000±n/a nM
Citation
 Tamiz, APWhittemore, ERZhou, ZLHuang, JCDrewe, JAChen, JCCai, SXWeber, EWoodward, RMKeana, JF Structure-activity relationships for a series of bis(phenylalkyl)amines: potent subtype-selective inhibitors of N-methyl-D-aspartate receptors. J Med Chem 41:3499-506 (1998)  
Target
Name:
Glutamate receptor ionotropic, NMDA 1/2C
Synonyms:
Glutamate NMDA receptor; Grin1/Grin2c | Glutamate [NMDA] receptor subunit epsilon 3/zeta 1
Type:
Mol. Mass.:
Description:
ASSAY_ID of EBI is 141029
Components:
This complex has 2 components.
Component 1
Name:
Glutamate receptor ionotropic, NMDA 1
Synonyms:
Glutamate (NMDA) receptor subunit zeta 1 Glutamate-NMDA-Channel Glutamate-NMDA-Polyamine NMDA Nmdar1 | phencyclidine
Type:
Enzyme Catalytic Domain
Mol. Mass.:
105533.40
Organism:
RAT
Description:
P35439
Residue:
938
  
Component 2
Name:
Glutamate receptor ionotropic, NMDA 2C
Synonyms:
Glutamate NMDA receptor; Grin1/Grin2c Grin2c NMDE3_RAT
Type:
Protein
Mol. Mass.:
135305.94
Organism:
Rattus norvegicus (Rat)
Description:
Q00961
Residue:
1237
  
Inhibitor
Name:
BDBM50066541
Synonyms:
4-[2-(4-Benzyl-piperidin-1-yl)-ethyl]-phenol; hydrochloride | CHEMBL545284
Type:
Small organic molecule
Emp. Form.:
C20H25NO
Mol. Mass.:
295.4186
SMILES:
Oc1ccc(CCN2CCC(Cc3ccccc3)CC2)cc1
: