Target
Sodium-dependent serotonin transporter
Ligand
BDBM50062368
Substrate
Meas. Tech.
ChEMBL_202318 (CHEMBL807674)
IC50
88±n/a nM
Citation
 Keverline-Frantz, KIBoja, JWKuhar, MJAbraham, PBurgess, JPLewin, AHCarroll, FI Synthesis and ligand binding of tropane ring analogues of paroxetine. J Med Chem 41:247-57 (1998)  
Target
Name:
Sodium-dependent serotonin transporter
Synonyms:
5-HT Transporter 5HT transporter Anandamid membrane transporter, AMT Monoamine transporters; Norepinephrine & serotonin Slc6a4 Sodium-dependent serotonin transporter (SERT) | imipramine receptor
Type:
Multi-pass membrane protein
Mol. Mass.:
70168.43
Organism:
Rattus norvegicus (rat)
Description:
P31652
Residue:
630
  
Inhibitor
Name:
BDBM50062368
Synonyms:
(2S,3S,8R)-2-(Benzo[1,3]dioxol-5-yloxymethyl)-3-(4-fluoro-phenyl)-8-methyl-8-aza-bicyclo[3.2.1]octane
Type:
Small organic molecule
Emp. Form.:
C22H24FNO3
Mol. Mass.:
369.4293
SMILES:
CN1C2CCC1[C@@H](COc1ccc3OCOc3c1)[C@H](C2)c1ccc(F)cc1
: