Target
Transporter
Ligand
BDBM50062375
Substrate
Meas. Tech.
ChEMBL_144837 (CHEMBL750463)
IC50
37400±n/a nM
Citation
 Keverline-Frantz, KIBoja, JWKuhar, MJAbraham, PBurgess, JPLewin, AHCarroll, FI Synthesis and ligand binding of tropane ring analogues of paroxetine. J Med Chem 41:247-57 (1998)  
Target
Name:
Transporter
Synonyms:
Monoamine transporters; Norepininephrine & dopamine | Norepinephrine Monoamine transporters
Type:
PROTEIN
Mol. Mass.:
66787.87
Organism:
Rattus norvegicus
Description:
ChEMBL_1463061
Residue:
597
  
Inhibitor
Name:
BDBM50062375
Synonyms:
(2S,3S,8R)-2-(Benzo[1,3]dioxol-5-yloxymethyl)-3-(4-fluoro-phenyl)-8-aza-bicyclo[3.2.1]octane CHEMBL87616
Type:
Small organic molecule
Emp. Form.:
C21H22FNO3
Mol. Mass.:
355.4027
SMILES:
Fc1ccc(cc1)[C@H]1CC2CCC(N2)[C@H]1COc1ccc2OCOc2c1
: