Target
Sodium-dependent serotonin transporter
Ligand
BDBM50006781
Substrate
Meas. Tech.
ChEMBL_201834 (CHEMBL805341)
Ki
12±n/a nM
Citation
 Kozikowski, APAraldi, GLPrakash, KRZhang, MJohnson, KM Synthesis and biological properties of new 2beta-alkyl- and 2beta-aryl-3-(substituted phenyl)tropane derivatives: stereochemical effect of C-3 on affinity and selectivity for neuronal dopamine and serotonin transporters. J Med Chem 41:4973-82 (1999)  
Target
Name:
Sodium-dependent serotonin transporter
Synonyms:
5-HT Transporter 5HT transporter Anandamid membrane transporter, AMT Monoamine transporters; Norepinephrine & serotonin Slc6a4 Sodium-dependent serotonin transporter (SERT) | imipramine receptor
Type:
Multi-pass membrane protein
Mol. Mass.:
70168.43
Organism:
Rattus norvegicus (rat)
Description:
P31652
Residue:
630
  
Inhibitor
Name:
BDBM50006781
Synonyms:
(2S,3S)-methyl 8-methyl-3-p-tolyl-8-aza-bicyclo[3.2.1]octane-2-carboxylate 8-Methyl-3-p-tolyl-8-aza-bicyclo[3.2.1]octane-2-carboxylic acid methyl ester | CHEMBL312037
Type:
Small organic molecule
Emp. Form.:
C17H23NO2
Mol. Mass.:
273.37
SMILES:
COC(=O)[C@@H]1C2CC[C@H](C[C@@H]1c1ccc(C)cc1)N2C
: