Target
Aminopeptidase N
Ligand
BDBM50083375
Substrate
Meas. Tech.
ChEMBL_35498 (CHEMBL646408)
Ki
3400±n/a nM
Citation
 David, CBischoff, LMeudal, HMothé, ADe Mota, NDaNascimento, SLlorens-Cortes, CFournié-Zaluski, MCRoques, BP Investigation of subsite preferences in aminopeptidase A (EC 3.4.11.7) led to the design of the first highly potent and selective inhibitors of this enzyme. J Med Chem 42:5197-211 (2000)  
Target
Name:
Aminopeptidase N
Synonyms:
AMPN_PIG AP-M Alanyl aminopeptidase Aminopeptidase N (APN) Microsomal aminopeptidase pAPN
Type:
Protein
Mol. Mass.:
108810.25
Organism:
Sus scrofa (Pig)
Description:
P15145
Residue:
963
  
Inhibitor
Name:
BDBM50083375
Synonyms:
3-[(1S,2R)-1-((S)-1,2-Dicarboxy-ethylcarbamoyl)-2-methyl-butylamino]-2-mercapto-1-(2-sulfamoyl-ethyl)-propyl-ammonium
Type:
Small organic molecule
Emp. Form.:
C15H31N4O7S2
Mol. Mass.:
443.559
SMILES:
CC[C@@H](C)[C@H](NCC(S)C([NH3+])CCS(N)(=O)=O)C(=O)N[C@@H](CC(O)=O)C(O)=O
: