Target
5-hydroxytryptamine receptor 3A/3B
Ligand
BDBM50076401
Substrate
Meas. Tech.
ChEMBL_3232 (CHEMBL618918)
Ki
0.60±n/a nM
Citation
 Cappelli, AAnzini, MVomero, SCanullo, LMennuni, LMakovec, FDoucet, EHamon, MMenziani, MCDe Benedetti, PGBruni, GRomeo, MRGiorgi, GDonati, A Novel potent and selective central 5-HT3 receptor ligands provided with different intrinsic efficacy. 2. Molecular basis of the intrinsic efficacy of arylpiperazine derivatives at the central 5-HT3 receptors. J Med Chem 42:1556-75 (1999)  
Target
Name:
5-hydroxytryptamine receptor 3A/3B
Synonyms:
Serotonin 3 (5-HT3) receptor | Serotonin 3a (5-HT3a)/3b (5-HT3b) receptor
Type:
Mol. Mass.:
Description:
ASSAY_ID of EBI is 2974
Components:
This complex has 2 components.
Component 1
Name:
5-hydroxytryptamine receptor 3B
Synonyms:
5HT3B_RAT Serotonin (5-HT) receptor
Type:
PROTEIN
Mol. Mass.:
50328.78
Organism:
Rattus norvegicus
Description:
EBI_11885
Residue:
437
  
Component 2
Name:
5-hydroxytryptamine receptor 3A
Synonyms:
5-HT3 5HT3A_RAT Htr3 Serotonin (5-HT) receptor | Zacopride site-R
Type:
Enzyme Catalytic Domain
Mol. Mass.:
55428.70
Organism:
RAT
Description:
5-HT3 HTR3A RAT::P35563
Residue:
483
  
Inhibitor
Name:
BDBM50076401
Synonyms:
CHEMBL41511 | [2-(4-Methyl-piperazin-1-yl)-4-phenyl-quinolin-3-yl]-acetic acid ethyl ester
Type:
Small organic molecule
Emp. Form.:
C24H27N3O2
Mol. Mass.:
389.4901
SMILES:
CCOC(=O)Cc1c(nc2ccccc2c1-c1ccccc1)N1CCN(C)CC1
: