Target
Gag-Pol polyprotein [489-587]
Ligand
BDBM50091607
Substrate
Meas. Tech.
ChEMBL_159321 (CHEMBL769374)
IC50
0.18±n/a nM
Citation
 Dorsey, BDMcDonough, CMcDaniel, SLLevin, RBNewton, CLHoffman, JMDarke, PLZugay-Murphy, JAEmini, EASchleif, WAOlsen, DBStahlhut, MWRutkowski, CAKuo, LCLin, JHChen, IWMichelson, SRHolloway, MKHuff, JRVacca, JP Identification of MK-944a: a second clinical candidate from the hydroxylaminepentanamide isostere series of HIV protease inhibitors. J Med Chem 43:3386-99 (2000)  
Target
Name:
Gag-Pol polyprotein [489-587]
Synonyms:
Human immunodeficiency virus type 1 protease Pol polyprotein | gag-pol
Type:
Enzyme Subunit
Mol. Mass.:
10781.16
Organism:
Human immunodeficiency virus type 1
Description:
P04585[489-587]
Residue:
99
  
Inhibitor
Name:
BDBM50091607
Synonyms:
1-[2-Hydroxy-4-(2-hydroxy-indan-1-ylcarbamoyl)-5-phenyl-pentyl]-4-(5-hydroxymethyl-furo[2,3-b]pyridin-2-ylmethyl)-piperazine-2-carboxylic acid tert-butylamide | CHEMBL116052
Type:
Small organic molecule
Emp. Form.:
C39H49N5O6
Mol. Mass.:
683.8363
SMILES:
CC(C)(C)NC(=O)C1CN(Cc2cc3cc(CO)cnc3o2)CCN1CC(O)CC(Cc1ccccc1)C(=O)NC1C(O)Cc2ccccc12
: