Target
Steroid 17-alpha-hydroxylase/17,20 lyase
Ligand
BDBM50093603
Substrate
Meas. Tech.
ChEMBL_50357 (CHEMBL662517)
IC50
270±n/a nM
Citation
 Hartmann, RWHector, MHaidar, SEhmer, PBReichert, WJose, J Synthesis and evaluation of novel steroidal oxime inhibitors of P450 17 (17 alpha-hydroxylase/C17-20-lyase) and 5 alpha-reductase types 1 and 2. J Med Chem 43:4266-77 (2000)  
Target
Name:
Steroid 17-alpha-hydroxylase/17,20 lyase
Synonyms:
CP17A_HUMAN CYP17A1 Cytochrome P450 17A1 Cytochrome P450 C17 (CYP17) Cytochrome P450-C17 P450-C17 Steroid 17-alpha-Monooxygenase (CYP17) Steroid 17-alpha-monooxygenase | cytochrome P450 monooxygenase 17 alpha hydroxylase/17,20-lyase (CYP17)
Type:
Enzyme
Mol. Mass.:
57382.42
Organism:
Homo sapiens (Human)
Description:
E.coli expressing human CYP17
Residue:
508
  
Inhibitor
Name:
BDBM50093603
Synonyms:
(3-Hydroxy-10,13-dimethyl-2,3,4,7,8,9,10,11,12,13,14,15,16,17-tetradecahydro-1H-cyclopenta[a]phenanthren-17-yl)-acetaldehyde oxime | CHEMBL440165
Type:
Small organic molecule
Emp. Form.:
C21H33NO2
Mol. Mass.:
331.4922
SMILES:
CC12CCC3C(CC=C4CC(O)CCC34C)C1CCC2CCN=O
: