Target
D(2) dopamine receptor
Ligand
BDBM50369789
Substrate
Meas. Tech.
ChEMBL_61595 (CHEMBL675767)
IC50
410±n/a nM
Citation
 Guzikowski, APTamiz, APAcosta-Burruel, MHong-Bae, SCai, SXHawkinson, JEKeana, JFKesten, SRShipp, CTTran, MWhittemore, ERWoodward, RMWright, JLZhou, ZL Synthesis of N-substituted 4-(4-hydroxyphenyl)piperidines, 4-(4-hydroxybenzyl)piperidines, and (+/-)-3-(4-hydroxyphenyl)pyrrolidines: selective antagonists at the 1A/2B NMDA receptor subtype. J Med Chem 43:984-94 (2000)  
Target
Name:
D(2) dopamine receptor
Synonyms:
DOPAMINE D2 DOPAMINE D2 Short Dopamine D2 receptor Drd2
Type:
G Protein-Coupled Receptor (GPCR)
Mol. Mass.:
50931.60
Organism:
Rattus norvegicus (rat)
Description:
P61169
Residue:
444
  
Inhibitor
Name:
BDBM50369789
Synonyms:
CHEMBL1203894
Type:
Small organic molecule
Emp. Form.:
C22H29NO
Mol. Mass.:
323.4718
SMILES:
COc1ccc(cc1)C1CCN(CCCCc2ccccc2)CC1
: