Target
Gag-Pol polyprotein [489-587]
Ligand
BDBM348
Substrate
Meas. Tech.
ChEMBL_158026 (CHEMBL768619)
Ki
0.4±n/a nM
Kd
11±n/a nM
KON
355000 M-1s-1
Citation
 Markgren, POSchaal, WHämäläinen, MKarlén, AHallberg, ASamuelsson, BDanielson, UH Relationships between structure and interaction kinetics for HIV-1 protease inhibitors. J Med Chem 45:5430-9 (2002)  
Target
Name:
Gag-Pol polyprotein [489-587]
Synonyms:
Human immunodeficiency virus type 1 protease Pol polyprotein | gag-pol
Type:
Enzyme Subunit
Mol. Mass.:
10781.16
Organism:
Human immunodeficiency virus type 1
Description:
P04585[489-587]
Residue:
99
  
Inhibitor
Name:
BDBM348
Synonyms:
(2R,3R,4R,5R)-2,5-bis(benzyloxy)-3,4-dihydroxy-N,N'-bis[(1S)-2-methyl-1-(methylcarbamoyl)propyl]hexanediamide C2-Symmetric Inhibitor 2 CHEMBL105459 | Diol-Based HIV-1 protease inhibitor 2
Type:
Small organic molecule
Emp. Form.:
C32H46N4O8
Mol. Mass.:
614.7296
SMILES:
CNC(=O)[C@@H](NC(=O)[C@H](OCc1ccccc1)[C@H](O)[C@@H](O)[C@@H](OCc1ccccc1)C(=O)N[C@@H](C(C)C)C(=O)NC)C(C)C
: