Target
Prothrombin
Ligand
BDBM12705
Substrate
Meas. Tech.
ChEMBL_208539 (CHEMBL813633)
Ki
>21000±n/a nM
Citation
 Pruitt, JRPinto, DJGalemmo, RAAlexander, RSRossi, KAWells, BLDrummond, SBostrom, LLBurdick, DBruckner, RChen, HSmallwood, AWong, PCWright, MRBai, SLuettgen, JMKnabb, RMLam, PYWexler, RR Discovery of 1-(2-aminomethylphenyl)-3-trifluoromethyl-N- [3-fluoro-2'-(aminosulfonyl)[1,1'-biphenyl)]-4-yl]-1H-pyrazole-5-carboxyamide (DPC602), a potent, selective, and orally bioavailable factor Xa inhibitor(1). J Med Chem 46:5298-315 (2003)  
Target
Name:
Prothrombin
Synonyms:
Activation peptide fragment 1 Coagulation factor II Prothrombin precursor Thrombin heavy chain | Thrombin light chain
Type:
Protein
Mol. Mass.:
70029.57
Organism:
Homo sapiens (Human)
Description:
P00734
Residue:
622
  
Inhibitor
Name:
BDBM12705
Synonyms:
CHEMBL146793 N-arylpyrazole carboxamide 3
Type:
Small organic molecule
Emp. Form.:
C25H19F4N3O4S
Mol. Mass.:
533.495
SMILES:
COc1ccc(cc1)-n1nc(cc1C(=O)Nc1ccc(cc1F)-c1ccccc1S(C)(=O)=O)C(F)(F)F
: