Target
Aldo-keto reductase family 1 member B1
Ligand
BDBM50154216
Substrate
Meas. Tech.
ChEMBL_305137 (CHEMBL832432)
IC50
14000±n/a nM
Citation
 Ferrari, AMWei, BQCostantino, LShoichet, BK Soft docking and multiple receptor conformations in virtual screening. J Med Chem 47:5076-84 (2004)  
Target
Name:
Aldo-keto reductase family 1 member B1
Synonyms:
AKR1B1 ALR2 Aldose reductase
Type:
PROTEIN
Mol. Mass.:
35865.31
Organism:
Sus scrofa
Description:
ChEMBL_502637
Residue:
316
  
Inhibitor
Name:
BDBM50154216
Synonyms:
CHEMBL186124 | [1-(3-Chloro-benzyl)-1H-indol-3-yl]-acetic acid
Type:
Small organic molecule
Emp. Form.:
C17H14ClNO2
Mol. Mass.:
299.752
SMILES:
OC(=O)Cc1cn(Cc2cccc(Cl)c2)c2ccccc12
: