Target
Somatostatin receptor type 5
Ligand
BDBM50159467
Substrate
Meas. Tech.
ChEMBL_306616 (CHEMBL829076)
IC50
>1000±n/a nM
Citation
 Rivier, JEKirby, DAErchegyi, JWaser, BEltschinger, VCescato, RReubi, JC Somatostatin receptor 1 selective analogues: 3. Dicyclic peptides. J Med Chem 48:515-22 (2005)  
Target
Name:
Somatostatin receptor type 5
Synonyms:
SOMATOSTATIN SST5 SS5-R SSR5_HUMAN Somatostatin receptor type 5 (SSTR5)
Type:
Enzyme
Mol. Mass.:
39218.02
Organism:
Homo sapiens (Human)
Description:
P35346
Residue:
364
  
Inhibitor
Name:
BDBM50159467
Synonyms:
CHEMBL265839 | cyclo(7-11) Des-AA1,5-[Tyr2,Glu7,D-Trp8,IAmp9,Lys11]SRIF
Type:
Small organic molecule
Emp. Form.:
C76H104N16O18S2
Mol. Mass.:
1593.865
SMILES:
CC(C)NCc1ccc(C[C@@H]2NC(=O)[C@H](Cc3c[nH]c4ccccc34)NC(=O)[C@H]3CCC(=O)NCCCC[C@@H](NC(=O)[C@H](NC2=O)[C@@H](C)O)C(=O)N[C@H]([C@@H](C)O)C(=O)N[C@@H](CO)C(=O)N[C@@H](CSSC[C@@H](NC(=O)[C@@H](N)Cc2ccc(O)cc2)C(=O)N[C@H](CCCCN)C(=O)N[C@H](Cc2ccccc2)C(=O)N3)C(O)=O)cc1
: