Target
D(2) dopamine receptor
Ligand
BDBM50180920
Substrate
Meas. Tech.
ChEMBL_327096 (CHEMBL859832)
Ki
82.6±n/a nM
Citation
 Hoefgen, BDecker, MMohr, PSchramm, AMRostom, SAEl-Subbagh, HSchweikert, PMRudolf, DRKassack, MULehmann, J Dopamine/serotonin receptor ligands. 10: SAR Studies on azecine-type dopamine receptor ligands by functional screening at human cloned D1, D2L, and D5 receptors with a microplate reader based calcium assay lead to a novel potent D1/D5 selective antagonist. J Med Chem 49:760-9 (2006)  
Target
Name:
D(2) dopamine receptor
Synonyms:
D(2) dopamine receptor DOPAMINE D2 Long DRD2 Dopamine D2 receptor Dopamine D2 receptor (D2R) Dopamine2-like | d2
Type:
Cell-surface receptors
Mol. Mass.:
50647.10
Organism:
Homo sapiens (Human)
Description:
P14416
Residue:
443
  
Inhibitor
Name:
BDBM50180920
Synonyms:
7-ethyl-6,7,8,9,14,15-hexahydro-5H-benz[d]indolo[2,3-g]azecine | CHEMBL382850
Type:
Small organic molecule
Emp. Form.:
C21H24N2
Mol. Mass.:
304.4287
SMILES:
CCN1CCc2c(Cc3ccccc3CC1)[nH]c1ccccc21
: