Target
Gag-Pol polyprotein [489-587]
Ligand
BDBM50370706
Substrate
Meas. Tech.
ChEMBL_340965 (CHEMBL866517)
Ki
18±n/a nM
Citation
 Ekegren, JKGinman, NJohansson, AWallberg, HLarhed, MSamuelsson, BUnge, THallberg, A Microwave-accelerated synthesis of P1'-extended HIV-1 protease inhibitors encompassing a tertiary alcohol in the transition-state mimicking scaffold. J Med Chem 49:1828-32 (2006)  
Target
Name:
Gag-Pol polyprotein [489-587]
Synonyms:
Human immunodeficiency virus type 1 protease Pol polyprotein | gag-pol
Type:
Enzyme Subunit
Mol. Mass.:
10781.16
Organism:
Human immunodeficiency virus type 1
Description:
P04585[489-587]
Residue:
99
  
Inhibitor
Name:
BDBM50370706
Synonyms:
CHEMBL1203922
Type:
Small organic molecule
Emp. Form.:
C41H45N5O6
Mol. Mass.:
703.8259
SMILES:
COC(=O)N[C@H](C(=O)NN(Cc1cccc(c1)C#Cc1cccnc1)C[C@@](O)(Cc1ccccc1)C(=O)N[C@@H]1[C@H](O)Cc2ccccc12)C(C)(C)C
: