Target
Tyrosine-protein phosphatase non-receptor type 1
Ligand
BDBM50185124
Substrate
Meas. Tech.
ChEMBL_358378 (CHEMBL854300)
IC50
14200±n/a nM
Citation
 Na, MCui, LMin, BSBae, KYoo, JKKim, BYOh, WKAhn, JS Protein tyrosine phosphatase 1B inhibitory activity of triterpenes isolated from Astilbe koreana. Bioorg Med Chem Lett 16:3273-6 (2006)  
Target
Name:
Tyrosine-protein phosphatase non-receptor type 1
Synonyms:
PTN1_HUMAN PTPN1 Protein tyrosine phosphatase-1B (PTP1B) Protein-tyrosine phosphatase 1B (PTP1B) Tyrosine-protein phosphatase non-receptor type 1 (PTP1B)
Type:
Protein phosphatase
Mol. Mass.:
49963.76
Organism:
Homo sapiens (Human)
Description:
Human recombinant GST-fusion PTP1B (1-435).
Residue:
435
  
Inhibitor
Name:
BDBM50185124
Synonyms:
CHEMBL381707 | methyl 3beta-hydroxyolean-12-en-28-oate
Type:
Small organic molecule
Emp. Form.:
C30H48O3
Mol. Mass.:
456.7003
SMILES:
COC(=O)[C@@]12CCC3C(=CC[C@H]4[C@@]3(C)CCC3C(C)(C)[C@@H](O)CC[C@]43C)[C@@H]1CC(C)(C)CC2
: