Target
Egl nine homolog 1
Ligand
BDBM50370783
Substrate
Meas. Tech.
ChEMBL_424035 (CHEMBL855663)
IC50
2900±n/a nM
Citation
 Warshakoon, NCWu, SBoyer, AKawamoto, RRenock, SXu, KPokross, MEvdokimov, AGZhou, SWinter, CWalter, RMekel, M Design and synthesis of a series of novel pyrazolopyridines as HIF-1alpha prolyl hydroxylase inhibitors. Bioorg Med Chem Lett 16:5687-90 (2006)  
Target
Name:
Egl nine homolog 1
Synonyms:
C1orf12 EGLN1_HUMAN Hypoxia-inducible factor prolyl hydroxylase 2 (HIF-PH2) Prolyl hydroxylase domain-containing protein 2 (PHD2)
Type:
Protein
Mol. Mass.:
46035.59
Organism:
Homo sapiens (Human)
Description:
Q9GZT9
Residue:
426
  
Inhibitor
Name:
BDBM50370783
Synonyms:
CHEMBL386421
Type:
Small organic molecule
Emp. Form.:
C18H14F3N3O3
Mol. Mass.:
377.3173
SMILES:
OC(=O)c1cnn(c1)-c1ccc(COCc2cccc(c2)C(F)(F)F)cn1
: