Target
Metabotropic glutamate receptor 5
Ligand
BDBM50198702
Substrate
Meas. Tech.
ChEMBL_432812 (CHEMBL914080)
Ki
1.8±n/a nM
Citation
 Hintermann, SVranesic, IAllgeier, HBrülisauer, AHoyer, DLemaire, MMoenius, TUrwyler, SWhitebread, SGasparini, FAuberson, YP ABP688, a novel selective and high affinity ligand for the labeling of mGlu5 receptors: identification, in vitro pharmacology, pharmacokinetic and biodistribution studies. Bioorg Med Chem 15:903-14 (2006)  
Target
Name:
Metabotropic glutamate receptor 5
Synonyms:
GRM5_RAT Grm5 Mglur5 metabotropic glutamate 5/1-C metabotropic glutamate 5a
Type:
Enzyme
Mol. Mass.:
131900.14
Organism:
Rattus norvegicus (Rat)
Description:
P31424
Residue:
1203
  
Inhibitor
Name:
BDBM50198702
Synonyms:
(E)-3-((6-methylpyridin-2-yl)ethynyl)cyclohex-2-enone O-methyl oxime CHEMBL227853 | CHEMBL228196
Type:
Small organic molecule
Emp. Form.:
C15H16N2O
Mol. Mass.:
240.3003
SMILES:
CO\N=C1/CCCC(=C1)C#Cc1cccc(C)n1
: