Target
Enoyl-acyl-carrier protein reductase
Ligand
BDBM50211897
Substrate
Meas. Tech.
ChEMBL_436469 (CHEMBL904776)
Ki
2000±n/a nM
Citation
 Kumar, GParasuraman, PSharma, SKBanerjee, TKarmodiya, KSurolia, NSurolia, A Discovery of a rhodanine class of compounds as inhibitors of Plasmodium falciparum enoyl-acyl carrier protein reductase. J Med Chem 50:2665-75 (2007)  
Target
Name:
Enoyl-acyl-carrier protein reductase
Synonyms:
Type:
PROTEIN
Mol. Mass.:
49770.86
Organism:
Plasmodium falciparum
Description:
ChEMBL_795989
Residue:
432
  
Inhibitor
Name:
BDBM50211897
Synonyms:
(Z)-5-((5-(2,5-dichlorophenyl)furan-2-yl)methylene)-2-thioxothiazolidin-4-one CHEMBL390528
Type:
Small organic molecule
Emp. Form.:
C14H7Cl2NO2S2
Mol. Mass.:
356.247
SMILES:
SC1=NC(=O)C(S1)=Cc1ccc(o1)-c1cc(Cl)ccc1Cl
: