Target
Adenosine receptor A3
Ligand
BDBM50224363
Substrate
Meas. Tech.
ChEMBL_450737 (CHEMBL901020)
Ki
103±n/a nM
Citation
 Da Settimo, FPrimofiore, GTaliani, SMarini, AMLa Motta, CSimorini, FSalerno, SSergianni, VTuccinardi, TMartinelli, ACosimelli, BGreco, GNovellino, ECiampi, OTrincavelli, MLMartini, C 5-amino-2-phenyl[1,2,3]triazolo[1,2-a][1,2,4]benzotriazin-1-one: a versatile scaffold to obtain potent and selective A3 adenosine receptor antagonists. J Med Chem 50:5676-84 (2007)  
Target
Name:
Adenosine receptor A3
Synonyms:
A3 adenosine receptor (hA3) ADORA3 | Adenosine A3 receptor (A3AR)
Type:
G Protein-Coupled Receptor (GPCR)
Mol. Mass.:
36197.32
Organism:
Homo sapiens (Human)
Description:
P0DMS8
Residue:
318
  
Inhibitor
Name:
BDBM50224363
Synonyms:
4-amino-8-chloro-2-p-tolyl-3,3a,5,9b-tetraaza-cyclopenta[a]naphthalen-1-one | CHEMBL392136
Type:
Small organic molecule
Emp. Form.:
C16H12ClN5O
Mol. Mass.:
325.752
SMILES:
Cc1ccc(cc1)-c1nn2c(N)nc3ccc(Cl)cc3n2c1=O
: